BDBM238845 US9403803, 5
SMILES Cc1ccoc1C(=O)Nc1ccc(cc1)-c1[nH]c2ccccc2c1C(N)=O
InChI Key InChIKey=BXNXVUOLJBPCNA-UHFFFAOYSA-N
Data  1 IC50
  Tab Delimited (TSV)   2D SDfile   Computed 3D by Vconf -m prep SDfile
Find this compound or compounds like it in BindingDB:
Activity Spreadsheet -- Enzyme Inhibition Constant Data from BindingDB
Found 1 hit for monomerid = 238845
TargetVascular endothelial growth factor receptor 2(Homo sapiens (Human))
Allergan
US Patent
LigandPNGBDBM238845(US9403803, 5)
Affinity DataIC50: >1.00E+4nMpH: 7.4 T: 2°C. Assay description: Biochemical KDR kinase assays were performed in 96 well microtiter plates that were coated overnight with 75 μg/well of poly-Glu-Tyr (4:1) in 10 m...
Ligand InfoPC cidPC sid
In DepthDetails US Patent