BDBM238935 US9403831, 20
SMILES CN1CCC(CC1)c1cnc(nc1)N1CCO[C@H](Cn2nnc3ncc(nc23)-c2cnn(C)c2)C1
InChI Key InChIKey=YGGOQTRGZVIXPE-IBGZPJMESA-N
Data  1 IC50
  Tab Delimited (TSV)   2D SDfile   Computed 3D by Vconf -m prep SDfile
Find this compound or compounds like it in BindingDB:
Activity Spreadsheet -- Enzyme Inhibition Constant Data from BindingDB
Found 1 hit for monomerid = 238935
TargetHepatocyte growth factor receptor(Homo sapiens (Human))
Korea Research Institute Of Chemical Technology
US Patent
LigandPNGBDBM238935(US9403831, 20)
Affinity DataIC50:  2nMT: 2°C. Assay description: The c-Met kinase inhibitory activity was analyzed using dissociation enhanced lanthanide fluoro-immunoassay (DELFIA, Perkin Elmer), which is a kind o...
Ligand InfoPC cidPC sid
In DepthDetails US Patent