BDBM238946 US9403831, 39
SMILES CN1CCN(Cc2ccc(cc2F)-c2cnc(nc2)N2CCOC(Cn3nnc4ncc(nc34)-c3ccc(F)c(c3)C#N)C2)CC1
InChI Key InChIKey=OWXMGTSTXSQSDS-UHFFFAOYSA-N
Data  1 IC50
  Tab Delimited (TSV)   2D SDfile   Computed 3D by Vconf -m prep SDfile
Find this compound or compounds like it in BindingDB:
Activity Spreadsheet -- Enzyme Inhibition Constant Data from BindingDB
Found 1 hit for monomerid = 238946
TargetHepatocyte growth factor receptor(Homo sapiens (Human))
Korea Research Institute Of Chemical Technology
US Patent
LigandPNGBDBM238946(US9403831, 39)
Affinity DataIC50:  2nMT: 2°C. Assay description: The c-Met kinase inhibitory activity was analyzed using dissociation enhanced lanthanide fluoro-immunoassay (DELFIA, Perkin Elmer), which is a kind o...
Ligand InfoPC cidPC sid
In DepthDetails US Patent