BDBM238972 US9403833, 7
SMILES Cc1c(nnn1-c1ccc(Cl)cc1Cl)C(=O)Nc1c(C)n(C)n(-c2ccccc2F)c1=O
InChI Key InChIKey=MOKGJPFJPBCJGY-UHFFFAOYSA-N
Data  1 IC50
  Tab Delimited (TSV)   2D SDfile   Computed 3D by Vconf -m prep SDfile
Find this compound or compounds like it in BindingDB:
Activity Spreadsheet -- Enzyme Inhibition Constant Data from BindingDB
Found 1 hit for monomerid = 238972
TargetE3 ubiquitin-protein ligase SMURF1 [420-757](Homo sapiens (Human))
Novartis
US Patent
LigandPNGBDBM238972(US9403833, 7)
Affinity DataIC50:  5.80E+3nMT: 2°C. Assay description: For the biochemical assay panel, 50 nl of the test compounds, reference compounds and buffer/DMSO control are transferred to the respective wells of ...
Ligand InfoPC cidPC sid
In DepthDetails US Patent