BDBM239068 US9409900, 65
SMILES CN(C)C(=O)c1ccc(Oc2ccc(Nc3ccccn3)cc2CN2CCCC2=O)cn1
InChI Key InChIKey=AYUZMIVZEJRKQS-UHFFFAOYSA-N
Data  1 EC50
  Tab Delimited (TSV)   2D SDfile   Computed 3D by Vconf -m prep SDfile
Find this compound or compounds like it in BindingDB:
Activity Spreadsheet -- Enzyme Inhibition Constant Data from BindingDB
Found 1 hit for monomerid = 239068
TargetHexokinase-4(Mus musculus (Mouse))
Fujian Haixi Pharmaceuticals
US Patent
LigandPNGBDBM239068(US9409900, 65)
Affinity DataEC50:  5.00E+3nMpH: 7.1Assay Description:The final assay volume was 200 uL and the final buffer conditions used in this assay were as follows: 25 mM HEPES, 5 mM glucose, 1 mM ATP, 2 mM MgCl2...
Ligand InfoPC cidPC sid
In DepthDetails US Patent