BDBM239125 US9403810, 15b
SMILES Cc1c(noc1[C@H]1CCC[C@H](O1)C(C)(C)C)C(=O)Nc1c(C)n(C)n(C2CCC2)c1=O
InChI Key InChIKey=HSVDEPRFXVRJIG-SJORKVTESA-N
Data  1 IC50
  Tab Delimited (TSV)   2D SDfile   Computed 3D by Vconf -m prep SDfile
Find this compound or compounds like it in BindingDB:
Activity Spreadsheet -- Enzyme Inhibition Constant Data from BindingDB
Found 1 hit for monomerid = 239125
TargetE3 ubiquitin-protein ligase SMURF1 [420-757](Homo sapiens (Human))
Novartis
US Patent
LigandPNGBDBM239125(US9403810, 15b)
Affinity DataIC50:  630nMT: 2°C. Assay description: For the biochemical assay panel, 50 nl of the test compounds, reference compounds and buffer/DMSO control are transferred to the respective wells of ...
Ligand InfoPC cidPC sid
In DepthDetails US Patent