BDBM239191 US10053433, FC 3.077
SMILES C[C@](O)(CS(=O)(=O)c1ccc(F)cc1)C(=O)Nc1cc(c(cn1)C#N)C(F)(F)F
InChI Key InChIKey=YJEAGZRUUPZIKH-INIZCTEOSA-N
Data  1 IC50
  Tab Delimited (TSV)   2D SDfile   Computed 3D by Vconf -m prep SDfile
Find this compound or compounds like it in BindingDB:
Activity Spreadsheet -- Enzyme Inhibition Constant Data from BindingDB
Found 1 hit for monomerid = 239191
TargetAndrogen receptor(Homo sapiens (Human))
The Regents Of The University Of California
US Patent
LigandPNGBDBM239191(US10053433, FC 3.077)
Affinity DataIC50:  490nMpH: 7.5Assay Description:Briefly, the AR LBD is expressed as a fusion with the Gal4 transcription factor, which binds to the Gal4 reporter DNA. Upon activation with agonist h...
Ligand InfoPC cidPC sid
In DepthDetails US Patent