BDBM23920 3-amidinophenylalanine deriv., 62::3-amino-N-(3-{[(2S)-1-[4-(3-aminopropyl)piperidin-1-yl]-3-(3-carbamimidoylphenyl)-1-oxopropan-2-yl]sulfamoyl}phenyl)propanamide
SMILES NCCCC1CCN(CC1)C(=O)[C@H](Cc1cccc(c1)C(N)=N)NS(=O)(=O)c1cccc(NC(=O)CCN)c1
InChI Key InChIKey=FPBMUTVWKLSSHT-DEOSSOPVSA-N
Data  5 KI
  Tab Delimited (TSV)   2D SDfile   Computed 3D by Vconf -m prep SDfile
Find this compound or compounds like it in BindingDB:
Activity Spreadsheet -- Enzyme Inhibition Constant Data from BindingDB
Found 5 hits for monomerid = 23920
TargetSuppressor of tumorigenicity 14 protein(Homo sapiens (Human))
Curacyte Chemistry
LigandPNGBDBM23920(3-amidinophenylalanine deriv., 62 | 3-amino-N-(3-{...)
Affinity DataKi:  5nM. Assay description: The measurements were carried out on a microplate reader. Two concentrations of the substrate and five concentrations of the inhibitor were used. Af...
In DepthDetails ArticlePubMed
TargetUrokinase-type plasminogen activator(Homo sapiens (Human))
Curacyte Chemistry
LigandPNGBDBM23920(3-amidinophenylalanine deriv., 62 | 3-amino-N-(3-{...)
Affinity DataKi:  1.50E+3nM. Assay description: The measurements were carried out on a microplate reader. Two concentrations of the substrate and five concentrations of the inhibitor were used. Af...
In DepthDetails ArticlePubMed
TargetPlasminogen(Homo sapiens (Human))
Curacyte Chemistry
LigandPNGBDBM23920(3-amidinophenylalanine deriv., 62 | 3-amino-N-(3-{...)
Affinity DataKi:  2.70E+3nM. Assay description: The measurements were carried out on a microplate reader. Two concentrations of the substrate and five concentrations of the inhibitor were used. Af...
In DepthDetails ArticlePubMed
TargetProthrombin(Bos taurus (Bovine))
Curacyte Chemistry
LigandPNGBDBM23920(3-amidinophenylalanine deriv., 62 | 3-amino-N-(3-{...)
Affinity DataKi:  1.30E+4nM. Assay description: The measurements were carried out on a microplate reader. Two concentrations of the substrate and five concentrations of the inhibitor were used. Af...
In DepthDetails ArticlePubMed
TargetCoagulation factor X(Bos taurus)
Curacyte Chemistry
LigandPNGBDBM23920(3-amidinophenylalanine deriv., 62 | 3-amino-N-(3-{...)
Affinity DataKi:  1.50E+4nM. Assay description: The measurements were carried out on a microplate reader. Two concentrations of the substrate and five concentrations of the inhibitor were used. Af...
In DepthDetails ArticlePubMed