BDBM239445 US10053431, 98b
SMILES CN[C@@H](C)C(=O)N[C@H]1CN(c2ccccc2N(Cc2c(C)ccc3ccccc23)C1=O)S(=O)(=O)NC
InChI Key InChIKey=UQLXBECWUIVNNI-AVRDEDQJSA-N
Data  2 IC50
  Tab Delimited (TSV)   2D SDfile   Computed 3D by Vconf -m prep SDfile
Find this compound or compounds like it in BindingDB:
Activity Spreadsheet -- Enzyme Inhibition Constant Data from BindingDB
Found 2 hits for monomerid = 239445
TargetE3 ubiquitin-protein ligase XIAP [241-356](Homo sapiens (Human))
Hoffmann-La Roche
US Patent
LigandPNGBDBM239445(US10053431, 98b)
Affinity DataIC50: >5.48E+4nMpH: 7.5 T: 2°C. Assay description: Ten nanomolar of 6× Histidine-tagged BIR2 domain, corresponding to amino acids 124-240 of XIAP, or BIR3 domain, corresponding to amino acids 241-356 ...
Ligand InfoPC cidPC sid
In DepthDetails US Patent
TargetE3 ubiquitin-protein ligase XIAP [124-240](Homo sapiens (Human))
Hoffmann-La Roche
US Patent
LigandPNGBDBM239445(US10053431, 98b)
Affinity DataIC50:  188nMpH: 7.5 T: 2°C. Assay description: Ten nanomolar of 6× Histidine-tagged BIR2 domain, corresponding to amino acids 124-240 of XIAP, or BIR3 domain, corresponding to amino acids 241-356 ...
Ligand InfoPC cidPC sid
In DepthDetails US Patent