BDBM239686 US9394309, 143
SMILES Cc1cc(C)c(cc1NC(=O)c1cc(cc(c1)S(F)(F)(F)(F)F)N1CCCCC1)-n1ccn2nc(cc12)-c1cccnc1
InChI Key InChIKey=MJZBGDXVRRHQIN-UHFFFAOYSA-N
Data  1 IC50
  Tab Delimited (TSV)   2D SDfile   Computed 3D by Vconf -m prep SDfile
Find this compound or compounds like it in BindingDB:
Activity Spreadsheet -- Enzyme Inhibition Constant Data from BindingDB
Found 1 hit for monomerid = 239686
TargetAngiopoietin-1 receptor [776-1124](Homo sapiens (Human))
Bayer Pharma Aktiengesellschaft
US Patent
LigandPNGBDBM239686(US9394309, 143)
Affinity DataIC50:  1.30nMpH: 7.0 T: 2°C. Assay description: For the assay, 50 nl of a 100-fold concentrated solution of the respective test substance in DMSO were pipetted into a black low-volume 384-well micr...
Ligand InfoPC cidPC sid
In DepthDetails US Patent