BDBM239758 US9394311, 41
SMILES Cc1nc(C)c2nc(CCc3nc(nn3C)N3CCCC3)nn2c1C
InChI Key InChIKey=OLLMHJKEIBORDO-UHFFFAOYSA-N
Data  1 IC50
PDB links: 1 PDB ID matches this monomer.
  Tab Delimited (TSV)   2D SDfile   Computed 3D by Vconf -m prep SDfile
Find this compound or compounds like it in BindingDB:
Activity Spreadsheet -- Enzyme Inhibition Constant Data from BindingDB
Found 1 hit for monomerid = 239758
TargetcAMP and cAMP-inhibited cGMP 3',5'-cyclic phosphodiesterase 10A(Homo sapiens (Human))
Hoffmann-La Roche
US Patent
LigandPNGBDBM239758(US9394311, 41)
Affinity DataIC50:  37.3nMT: 2°C. Assay description: The human PDE10A full length assay was performed in 96-well micro titer plates. The reaction mixture of 50 μl contained 20 mM HEPES pH=7.5/10 mM M...
Ligand InfoPC cidPC sidPDB