BDBM239805 Roche-Dataset for PDE10A, Compound 434::US9394311, 88
SMILES Cc1c(Cl)cc(c2nc(CCc3nc(nn3C)N3CCC(F)(F)C3)nn12)C(F)(F)F
InChI Key InChIKey=UNVGETXXYQFUKG-UHFFFAOYSA-N
Data  2 IC50
  Tab Delimited (TSV)   2D SDfile   Computed 3D by Vconf -m prep SDfile
Find this compound or compounds like it in BindingDB:
Activity Spreadsheet -- Enzyme Inhibition Constant Data from BindingDB
Found 2 hits for monomerid = 239805
TargetcAMP and cAMP-inhibited cGMP 3',5'-cyclic phosphodiesterase 10A(Homo sapiens (Human))
F. Hoffmann-La Roche
LigandPNGBDBM239805(Roche-Dataset for PDE10A, Compound 434 | US9394311...)
Affinity DataIC50:  9.78nM. Assay description: Human PDE10A IC50 values were determined by using purified enzyme (Biomol cat. # SE-534) in a scintillation proximity assay (SPA) in 96 well plates (...
Ligand InfoPC cidPC sid
In DepthDetails ArticlePubMed
TargetcAMP and cAMP-inhibited cGMP 3',5'-cyclic phosphodiesterase 10A(Homo sapiens (Human))
F. Hoffmann-La Roche
LigandPNGBDBM239805(Roche-Dataset for PDE10A, Compound 434 | US9394311...)
Affinity DataIC50:  9.78nMT: 2°C. Assay description: The human PDE10A full length assay was performed in 96-well micro titer plates. The reaction mixture of 50 μl contained 20 mM HEPES pH=7.5/10 mM M...
Ligand InfoPC cidPC sid
In DepthDetails US Patent