BDBM239853 US9394311, 134
SMILES Clc1ccc2ncc(CCc3n[nH]c(n3)N3CCCC3)nc2c1
InChI Key InChIKey=BNQNCQRPNXQYDZ-UHFFFAOYSA-N
Data  1 IC50
  Tab Delimited (TSV)   2D SDfile   Computed 3D by Vconf -m prep SDfile
Find this compound or compounds like it in BindingDB:
Activity Spreadsheet -- Enzyme Inhibition Constant Data from BindingDB
Found 1 hit for monomerid = 239853
TargetcAMP and cAMP-inhibited cGMP 3',5'-cyclic phosphodiesterase 10A(Homo sapiens (Human))
Hoffmann-La Roche
US Patent
LigandPNGBDBM239853(US9394311, 134)
Affinity DataIC50:  33.0nMT: 2°C. Assay description: The human PDE10A full length assay was performed in 96-well micro titer plates. The reaction mixture of 50 μl contained 20 mM HEPES pH=7.5/10 mM M...
Ligand InfoPC cidPC sid
In DepthDetails US Patent