BDBM239914 US9403767, 85
SMILES CN(C)C1(CCC(CC1)(N(C)Cc1cccnc1)c1ccccc1)c1ccccc1
InChI Key InChIKey=CBOODYUURDDFRY-UHFFFAOYSA-N
Data  2 KI
  Tab Delimited (TSV)   2D SDfile   Computed 3D by Vconf -m prep SDfile
Find this compound or compounds like it in BindingDB:
Activity Spreadsheet -- Enzyme Inhibition Constant Data from BindingDB
Found 2 hits for monomerid = 239914
TargetNociceptin receptor(Homo sapiens (Human))
Gruenenthal
US Patent
LigandPNGBDBM239914(US9403767, 85)
Affinity DataKi:  0.810nMpH: 7.4Assay Description:The compounds were examined with membranes of recombinant CHO-ORL 1 cells in a receptor binding assay with 3H-nociceptin/orphanin FQ. This test syste...
Ligand InfoPC cidPC sid
In DepthDetails US Patent
TargetMu-type opioid receptor(Homo sapiens (Human))
Gruenenthal
US Patent
LigandPNGBDBM239914(US9403767, 85)
Affinity DataKi:  115nM ΔG°:  -9.46kcal/moleT: 2°C. Assay description: The affinity to the human μ-opiate receptor was determined in a homogeneous preparation in microtiter plates. For this, dilution series of the res...
Ligand InfoPC cidPC sid
In DepthDetails US Patent