BDBM239961 US9403801, 26
SMILES Cn1cc(Nc2ncc(Cl)c(NC3CCC4(CC3)CCN(CC4)C(=O)CC#N)n2)cn1
InChI Key InChIKey=WYSOPTDTJZSYSR-UHFFFAOYSA-N
Data  2 IC50
  Tab Delimited (TSV)   2D SDfile   Computed 3D by Vconf -m prep SDfile
Find this compound or compounds like it in BindingDB:
Activity Spreadsheet -- Enzyme Inhibition Constant Data from BindingDB
Found 2 hits for monomerid = 239961
TargetTyrosine-protein kinase JAK2(Homo sapiens (Human))
Calitor Sciences
US Patent
LigandPNGBDBM239961(US9403801, 26)
Affinity DataIC50:  6nMpH: 7.0 T: 2°C. Assay description: JAK2 (h) is incubated with 8 mM MOPS pH 7.0, 0.2 mM EDTA, 100 μM KTFCGTPEYLAPEVRREPRILSEEEQEMFRDFDYIADWC, 10 mM MgAcetate and [γ-33P-ATP](s...
Ligand InfoPC cidPC sid
In DepthDetails US Patent
TargetTyrosine-protein kinase JAK1(Homo sapiens (Human))
Calitor Sciences
US Patent
LigandPNGBDBM239961(US9403801, 26)
Affinity DataIC50:  2nMpH: 7.5 T: 2°C. Assay description: JAK1 (h) is incubated with 20 mM Tris/HCl pH 7.5, 0.2 mM EDTA, 500 μM GEEPLYWSFPAKKK, 10 mM MgAcetate and [γ-33P-ATP](specific activity app...
Ligand InfoPC cidPC sid
In DepthDetails US Patent