BDBM240022 US9403808, 33
SMILES CNC(=O)[C@H](CC(C)C)NC(=O)c1cnc(N2CC(F)(F)C2)c(OCC2CC2)n1
InChI Key InChIKey=LXYHSTMTYKCEGZ-ZDUSSCGKSA-N
Data  2 EC50
  Tab Delimited (TSV)   2D SDfile   Computed 3D by Vconf -m prep SDfile
Find this compound or compounds like it in BindingDB:
Activity Spreadsheet -- Enzyme Inhibition Constant Data from BindingDB
Found 2 hits for monomerid = 240022
TargetCannabinoid receptor 1(Homo sapiens (Human))
Hoffmann-La Roche
US Patent
LigandPNGBDBM240022(US9403808, 33)
Affinity DataEC50: >1.00E+4nMT: 2°C. Assay description: CHO cells expressing human CB1 or CB2 receptors are seeded 17-24 hours prior to the experiment 50.000 cells per well in a black 96 well plate with fl...
Ligand InfoPC cidPC sid
In DepthDetails US Patent
TargetCannabinoid receptor 2(Homo sapiens (Human))
Hoffmann-La Roche
US Patent
LigandPNGBDBM240022(US9403808, 33)
Affinity DataEC50:  11.8nMT: 2°C. Assay description: CHO cells expressing human CB1 or CB2 receptors are seeded 17-24 hours prior to the experiment 50.000 cells per well in a black 96 well plate with fl...
Ligand InfoPC cidPC sid
In DepthDetails US Patent