BDBM240255 US9403843, 22
SMILES CC(C)C[C@H](NC(=O)[C@H]1O[C@@H]1C(O)=O)C(=O)Nc1ccccc1
InChI Key InChIKey=DSYBPNGSSYYLJB-AVGNSLFASA-N
Data  1 IC50
  Tab Delimited (TSV)   2D SDfile   Computed 3D by Vconf -m prep SDfile
Find this compound or compounds like it in BindingDB:
Activity Spreadsheet -- Enzyme Inhibition Constant Data from BindingDB
Found 1 hit for monomerid = 240255
TargetCalpain-1 catalytic subunit(Homo sapiens (Human))
The Trustees Of Columbia University In The City Of New York
US Patent
LigandPNGBDBM240255(US9403843, 22)
Affinity DataIC50:  100nMpH: 7.4Assay Description:The Calbiochem InnoZyme activity kit was used for measuring the inhibition effect inhibitors on human erythrocyte calpain 1 activity. A calpain FRET ...
Ligand InfoKEGGPC cidPC sid
In DepthDetails US Patent