BDBM240258 US9403843, 35
SMILES Cn1cncc1C[C@H](NC(=O)[C@H]1O[C@@H]1C(O)=O)C(=O)Nc1nc(cs1)-c1ccc(F)cc1
InChI Key InChIKey=BGJLDFXOPKCGNN-BPUTZDHNSA-N
Data  1 IC50
  Tab Delimited (TSV)   2D SDfile   Computed 3D by Vconf -m prep SDfile
Find this compound or compounds like it in BindingDB:
Activity Spreadsheet -- Enzyme Inhibition Constant Data from BindingDB
Found 1 hit for monomerid = 240258
TargetCalpain-1 catalytic subunit(Homo sapiens (Human))
The Trustees Of Columbia University In The City Of New York
US Patent
LigandPNGBDBM240258(US9403843, 35)
Affinity DataIC50:  5.00E+3nMpH: 7.4Assay Description:The Calbiochem InnoZyme activity kit was used for measuring the inhibition effect inhibitors on human erythrocyte calpain 1 activity. A calpain FRET ...
Ligand InfoKEGGPC cidPC sid
In DepthDetails US Patent