BDBM24027 (2R)-2-[(3-amino-4-phenylbenzene)sulfonamido]-3-methylbutanoic acid::biphenylsulfonamide carboxylate, 4
SMILES CC(C)[C@@H](NS(=O)(=O)c1ccc(c(N)c1)-c1ccccc1)C(O)=O
InChI Key InChIKey=YEKGSQOVPVQUAB-MRXNPFEDSA-N
Data  1 IC50
  Tab Delimited (TSV)   2D SDfile   Computed 3D by Vconf -m prep SDfile
Find this compound or compounds like it in BindingDB:
Activity Spreadsheet -- Enzyme Inhibition Constant Data from BindingDB
Found 1 hit for monomerid = 24027
LigandPNGBDBM24027((2R)-2-[(3-amino-4-phenylbenzene)sulfonamido]-3-me...)
Affinity DataIC50:  3.00E+4nMpH: 7.5 T: 2°C. Assay description: The recombinant Agg-1 proteins pretreated with the various concentrations of the compound for 10 to 15 min. The reaction was initiated by addition of...
In DepthDetails ArticlePubMed