BDBM240347 US9409866, 62
SMILES Cc1nc(no1)C(C)(NC(=O)c1cc(OCC(F)(F)F)c(Cl)cn1)C1CC1
InChI Key InChIKey=JVKTXHGUJMNDBJ-UHFFFAOYSA-N
Data  2 EC50
  Tab Delimited (TSV)   2D SDfile   Computed 3D by Vconf -m prep SDfile
Find this compound or compounds like it in BindingDB:
Activity Spreadsheet -- Enzyme Inhibition Constant Data from BindingDB
Found 2 hits for monomerid = 240347
TargetCannabinoid receptor 1(Homo sapiens (Human))
Hoffmann-La Roche
US Patent
LigandPNGBDBM240347(US9409866, 62)
Affinity DataEC50: >1.00E+4nMT: 2°C. Assay description: CHO cells expressing human CB1 or CB2 receptors are seeded 17-24 hours prior to the experiment 50.000 cells per well in a black 96 well plate with fl...
Ligand InfoPC cidPC sid
In DepthDetails US Patent
TargetCannabinoid receptor 2(Homo sapiens (Human))
Hoffmann-La Roche
US Patent
LigandPNGBDBM240347(US9409866, 62)
Affinity DataEC50:  8.90nMT: 2°C. Assay description: CHO cells expressing human CB1 or CB2 receptors are seeded 17-24 hours prior to the experiment 50.000 cells per well in a black 96 well plate with fl...
Ligand InfoPC cidPC sid
In DepthDetails US Patent