BDBM24052 (2S)-4-(2,5-difluorophenyl)-N,N-dimethyl-2-phenyl-2,5-dihydro-1H-pyrrole-1-carboxamide::dihydropyrrole, 6
SMILES [H][C@]1(C=C(CN1C(=O)N(C)C)c1cc(F)ccc1F)c1ccccc1
InChI Key InChIKey=WFFMEXQHWXEKBV-SFHVURJKSA-N
Data  1 IC50
PDB links: 1 PDB ID matches this monomer.
  Tab Delimited (TSV)   2D SDfile   Computed 3D by Vconf -m prep SDfile
Find this compound or compounds like it in BindingDB:
Activity Spreadsheet -- Enzyme Inhibition Constant Data from BindingDB
Found 1 hit for monomerid = 24052
TargetA disintegrin and metalloproteinase with thrombospondin motifs 5(Homo sapiens (Human))
Merck Research Laboratories
LigandPNGBDBM24052((2S)-4-(2,5-difluorophenyl)-N,N-dimethyl-2-phenyl-...)
Affinity DataIC50:  38nMpH: 7.0 T: 2°C. Assay description: The kinesin motor domain is incubated with microtubules, 1 mM ATP (1: 1 MgCl2 : Na-ATP), and compound at 23°C in buffer. After reaction was term...
In DepthDetails ArticlePubMed