BDBM24059 (2R)-2-amino-1-[(2S)-4-(2,5-difluorophenyl)-2-phenyl-2,5-dihydro-1H-pyrrol-1-yl]-3-methylbutan-1-one::dihydropyrrole, 18
SMILES [H][C@]1(C=C(CN1C(=O)[C@H](N)C(C)C)c1cc(F)ccc1F)c1ccccc1
InChI Key InChIKey=GNFWJCGIZJCASB-VQTJNVASSA-N
Data  1 IC50
  Tab Delimited (TSV)   2D SDfile   Computed 3D by Vconf -m prep SDfile
Find this compound or compounds like it in BindingDB:
Activity Spreadsheet -- Enzyme Inhibition Constant Data from BindingDB
Found 1 hit for monomerid = 24059
TargetA disintegrin and metalloproteinase with thrombospondin motifs 5(Homo sapiens (Human))
Merck Research Laboratories
LigandPNGBDBM24059((2R)-2-amino-1-[(2S)-4-(2,5-difluorophenyl)-2-phen...)
Affinity DataIC50:  3.10E+3nMpH: 7.0 T: 2°C. Assay description: The kinesin motor domain is incubated with microtubules, 1 mM ATP (1: 1 MgCl2 : Na-ATP), and compound at 23°C in buffer. After reaction was term...
In DepthDetails ArticlePubMed