BDBM24067 3,5-diaryl-4,5-dihydropyrazole, 8a::3-(2,5-difluorophenyl)-N-methyl-5-phenyl-4,5-dihydro-1H-pyrazole-1-carboxamide::CHEMBL193686
SMILES CNC(=O)N1N=C(CC1c1ccccc1)c1cc(F)ccc1F
InChI Key InChIKey=FGAMMGLHXPEMRM-UHFFFAOYSA-N
Data  3 IC50
  Tab Delimited (TSV)   2D SDfile   Computed 3D by Vconf -m prep SDfile
Find this compound or compounds like it in BindingDB:
Activity Spreadsheet -- Enzyme Inhibition Constant Data from BindingDB
Found 3 hits for monomerid = 24067
TargetA disintegrin and metalloproteinase with thrombospondin motifs 5(Homo sapiens (Human))
Merck Research Laboratories
LigandPNGBDBM24067(3,5-diaryl-4,5-dihydropyrazole, 8a | 3-(2,5-difluo...)
Affinity DataIC50:  3.14E+3nMpH: 7.0 T: 2°C. Assay description: The kinesin motor domain is incubated with microtubules, 1 mM ATP (1: 1 MgCl2 : Na-ATP), and compound at 23°C in buffer. After reaction was term...
In DepthDetails ArticlePubMed
TargetKinesin-like protein KIF11(Homo sapiens (Human))
China Pharmaceutical University
Curated by ChEMBL
LigandPNGBDBM24067(3,5-diaryl-4,5-dihydropyrazole, 8a | 3-(2,5-difluo...)
Affinity DataIC50:  3.10E+3nM. Assay description: Inhibition of KSP
In DepthDetails ArticlePubMed
TargetKinesin-like protein KIF11(Homo sapiens (Human))
China Pharmaceutical University
Curated by ChEMBL
LigandPNGBDBM24067(3,5-diaryl-4,5-dihydropyrazole, 8a | 3-(2,5-difluo...)
Affinity DataIC50:  3.10E+3nM. Assay description: In vitro inhibitory concentration towards kinesin spindle protein activity of ATP hydrolysis in the presence of microtubules measured by ATPase assay...
In DepthDetails ArticlePubMed