BDBM24072 3,5-diaryl-4,5-dihydropyrazole, 8f::3-(2,5-difluorophenyl)-N-ethyl-5-(4-hydroxybutyl)-5-phenyl-4,5-dihydro-1H-pyrazole-1-carboxamide
SMILES CCNC(=O)N1N=C(CC1(CCCCO)c1ccccc1)c1cc(F)ccc1F
InChI Key InChIKey=LSPYJDKYIOCDAG-UHFFFAOYSA-N
Data  1 IC50
  Tab Delimited (TSV)   2D SDfile   Computed 3D by Vconf -m prep SDfile
Find this compound or compounds like it in BindingDB:
Activity Spreadsheet -- Enzyme Inhibition Constant Data from BindingDB
Found 1 hit for monomerid = 24072
TargetA disintegrin and metalloproteinase with thrombospondin motifs 5(Homo sapiens (Human))
Merck Research Laboratories
LigandPNGBDBM24072(3,5-diaryl-4,5-dihydropyrazole, 8f | 3-(2,5-difluo...)
Affinity DataIC50:  697nMpH: 7.0 T: 2°C. Assay description: The kinesin motor domain is incubated with microtubules, 1 mM ATP (1: 1 MgCl2 : Na-ATP), and compound at 23°C in buffer. After reaction was term...
In DepthDetails ArticlePubMed