BDBM240740 US9422263, 24
SMILES FC(F)C1=C(C#N)C(C(C#N)=C(N1)C(F)F)c1ccc2[nH]ncc2c1
InChI Key InChIKey=IJMNXEGVGVTCEE-UHFFFAOYSA-N
Data  1 IC50
  Tab Delimited (TSV)   2D SDfile   Computed 3D by Vconf -m prep SDfile
Find this compound or compounds like it in BindingDB:
Activity Spreadsheet -- Enzyme Inhibition Constant Data from BindingDB
Found 1 hit for monomerid = 240740
TargetHepatocyte growth factor receptor(Homo sapiens (Human))
Bayer Pharma Aktiengesellschaft
US Patent
LigandPNGBDBM240740(US9422263, 24)
Affinity DataIC50:  28nMpH: 7.0 T: 2°C. Assay description: Recombinant human c-Met protein (Invitrogen, Carlsbad, Calif., USA) is used. As substrate for the kinase reaction the peptide KKKSPGEYVNIEFG (JPT, Ge...
Ligand InfoPC cidPC sid
In DepthDetails US Patent