BDBM24077 3,5-diaryl-4,5-dihydropyrazole, 9b::3-(2,5-difluorophenyl)-5-[4-(dimethylamino)butyl]-N-ethyl-5-phenyl-4,5-dihydro-1H-pyrazole-1-carboxamide
SMILES CCNC(=O)N1N=C(CC1(CCCCN(C)C)c1ccccc1)c1cc(F)ccc1F
InChI Key InChIKey=YKFQESUWSKBWHG-UHFFFAOYSA-N
Data  1 IC50
  Tab Delimited (TSV)   2D SDfile   Computed 3D by Vconf -m prep SDfile
Find this compound or compounds like it in BindingDB:
Activity Spreadsheet -- Enzyme Inhibition Constant Data from BindingDB
Found 1 hit for monomerid = 24077
TargetA disintegrin and metalloproteinase with thrombospondin motifs 5(Homo sapiens (Human))
Merck Research Laboratories
LigandPNGBDBM24077(3,5-diaryl-4,5-dihydropyrazole, 9b | 3-(2,5-difluo...)
Affinity DataIC50:  103nMpH: 7.0 T: 2°C. Assay description: The kinesin motor domain is incubated with microtubules, 1 mM ATP (1: 1 MgCl2 : Na-ATP), and compound at 23°C in buffer. After reaction was term...
In DepthDetails ArticlePubMed