BDBM240782 US9422312, 19
SMILES CS(=O)(=NCc1ccc(cc1)-c1ccc(cc1)-c1nc2[nH]c(O[C@@H]3CO[C@@H]4[C@H](O)CO[C@H]34)nc2cc1Cl)N1CCCC1
InChI Key
Data  1 EC50
  Tab Delimited (TSV)   2D SDfile   Computed 3D by Vconf -m prep SDfile
Find this compound or compounds like it in BindingDB:
Activity Spreadsheet -- Enzyme Inhibition Constant Data from BindingDB
Found 1 hit for monomerid = 240782
Target5'-AMP-activated protein kinase catalytic subunit alpha-1/subunit beta-1/subunit gamma-1(Homo sapiens (Human))
Boehringer Ingelheim International
US Patent
LigandPNGBDBM240782(US9422312, 19)
Affinity DataEC50:  138nMpH: 7.0 T: 2°C. Assay description: In the 384-well plates 1.25 μl of test compound in assay buffer was mixed with 1.25 μl of AMPK and 1.25 μl of the peptide (final concentrati...
Ligand InfoPC cidPC sid
In DepthDetails US Patent