BDBM24085 3,5-diaryl-4,5-dihydropyrazole, 10b::3-[1-(azetidin-1-ylcarbonyl)-3-(2,5-difluorophenyl)-5-phenyl-4,5-dihydro-1H-pyrazol-5-yl]propan-1-amine
SMILES NCCCC1(CC(=NN1C(=O)N1CCC1)c1cc(F)ccc1F)c1ccccc1
InChI Key InChIKey=HRTBWTOXJOXCCB-UHFFFAOYSA-N
Data  1 IC50
  Tab Delimited (TSV)   2D SDfile   Computed 3D by Vconf -m prep SDfile
Find this compound or compounds like it in BindingDB:
Activity Spreadsheet -- Enzyme Inhibition Constant Data from BindingDB
Found 1 hit for monomerid = 24085
TargetA disintegrin and metalloproteinase with thrombospondin motifs 5(Homo sapiens (Human))
Merck Research Laboratories
LigandPNGBDBM24085(3,5-diaryl-4,5-dihydropyrazole, 10b | 3-[1-(azetid...)
Affinity DataIC50:  55nMpH: 7.0 T: 2°C. Assay description: The kinesin motor domain is incubated with microtubules, 1 mM ATP (1: 1 MgCl2 : Na-ATP), and compound at 23°C in buffer. After reaction was term...
In DepthDetails ArticlePubMed