BDBM240852 US9394331, 115
SMILES COC(=O)[C@H](C)NP(=O)(OCC1OC(n2ccc(=O)[nH]c2=O)[C@]2(CCO2)[C@@H]1O)Oc1ccccc1
InChI Key
Data  1 EC50
  Tab Delimited (TSV)   2D SDfile   Computed 3D by Vconf -m prep SDfile
Find this compound or compounds like it in BindingDB:
Activity Spreadsheet -- Enzyme Inhibition Constant Data from BindingDB
Found 1 hit for monomerid = 240852
TargetGenome polyprotein [2420-3010](Hepatitis C virus genotype 1b (isolate Con1) (HCV))
Gilead Pharmasset
US Patent
LigandPNGBDBM240852(US9394331, 115)
Affinity DataEC50:  2.85E+4nMpH: 7.5 T: 2°C. Assay description: The HCV NS5B reaction was performed in a 20 μL mixture containing varying concentrations of the test compound, 1 μM of all four natural ribonuc...
Ligand InfoPC cidPC sid
In DepthDetails US Patent