BDBM240933 US9409892, 28
SMILES OC(=O)C1(CNC(=O)c2nc(C#N)c3cc(Oc4cccnc4)ccc3c2O)CCC1
InChI Key InChIKey=NYIXYQZNDODKLM-UHFFFAOYSA-N
Data  2 IC50
  Tab Delimited (TSV)   2D SDfile   Computed 3D by Vconf -m prep SDfile
Find this compound or compounds like it in BindingDB:
Activity Spreadsheet -- Enzyme Inhibition Constant Data from BindingDB
Found 2 hits for monomerid = 240933
TargetEgl nine homolog 1(Homo sapiens (Human))
Fibrogen
US Patent
LigandPNGBDBM240933(US9409892, 28)
Affinity DataIC50:  7.15E+3nMpH: 7.4Assay Description:Ketoglutaric acid α-[1-14C]-sodium salt, alpha-ketoglutaric acid sodium salt, and HPLC purified peptide may be obtained from commercial sources...
Ligand InfoPC cidPC sid
In DepthDetails US Patent
TargetProlyl hydroxylase EGLN2(Homo sapiens (Human))
Fibrogen
US Patent
LigandPNGBDBM240933(US9409892, 28)
Affinity DataIC50:  1.30E+3nMpH: 7.4Assay Description:Ketoglutaric acid α-[1-14C]-sodium salt, alpha-ketoglutaric acid sodium salt, and HPLC purified peptide may be obtained from commercial sources...
Ligand InfoPC cidPC sid
In DepthDetails US Patent