BDBM240998 US9409892, 93
SMILES C[C@@H](CNC(=O)c1nc(C#N)c2cc(Oc3ccccc3)ccc2c1O)C(O)=O
InChI Key InChIKey=UBEYTGBZRYCLOZ-LBPRGKRZSA-N
Data  2 IC50
  Tab Delimited (TSV)   2D SDfile   Computed 3D by Vconf -m prep SDfile
Find this compound or compounds like it in BindingDB:
Activity Spreadsheet -- Enzyme Inhibition Constant Data from BindingDB
Found 2 hits for monomerid = 240998
TargetEgl nine homolog 1(Homo sapiens (Human))
Fibrogen
US Patent
LigandPNGBDBM240998(US9409892, 93)
Affinity DataIC50:  2.40E+3nMpH: 7.4Assay Description:Ketoglutaric acid α-[1-14C]-sodium salt, alpha-ketoglutaric acid sodium salt, and HPLC purified peptide may be obtained from commercial sources...
Ligand InfoPC cidPC sid
In DepthDetails US Patent
TargetProlyl hydroxylase EGLN2(Homo sapiens (Human))
Fibrogen
US Patent
LigandPNGBDBM240998(US9409892, 93)
Affinity DataIC50:  160nMpH: 7.4Assay Description:Ketoglutaric acid α-[1-14C]-sodium salt, alpha-ketoglutaric acid sodium salt, and HPLC purified peptide may be obtained from commercial sources...
Ligand InfoPC cidPC sid
In DepthDetails US Patent