BDBM241008 US9409892, 103
SMILES COc1ccc(Oc2ccc3c(O)c(ncc3c2)C(=O)NC[C@H](O)C(O)=O)cc1
InChI Key InChIKey=HBPBZJAYBQVBDY-INIZCTEOSA-N
Data  2 IC50
  Tab Delimited (TSV)   2D SDfile   Computed 3D by Vconf -m prep SDfile
Find this compound or compounds like it in BindingDB:
Activity Spreadsheet -- Enzyme Inhibition Constant Data from BindingDB
Found 2 hits for monomerid = 241008
TargetEgl nine homolog 1(Homo sapiens (Human))
Fibrogen
US Patent
LigandPNGBDBM241008(US9409892, 103)
Affinity DataIC50:  4.78E+3nMpH: 7.4Assay Description:Ketoglutaric acid α-[1-14C]-sodium salt, alpha-ketoglutaric acid sodium salt, and HPLC purified peptide may be obtained from commercial sources...
Ligand InfoKEGGPC cidPC sid
In DepthDetails US Patent
TargetProlyl hydroxylase EGLN2(Homo sapiens (Human))
Fibrogen
US Patent
LigandPNGBDBM241008(US9409892, 103)
Affinity DataIC50:  790nMpH: 7.4Assay Description:Ketoglutaric acid α-[1-14C]-sodium salt, alpha-ketoglutaric acid sodium salt, and HPLC purified peptide may be obtained from commercial sources...
Ligand InfoKEGGPC cidPC sid
In DepthDetails US Patent