BDBM241147 US9409895, 57::US9630945, 57
SMILES Clc1cc(Cl)cc(COC(=O)N2CCC(CNC(=O)CCc3cnn[nH]3)CC2)c1
InChI Key InChIKey=BGTUNXZYEFXERH-UHFFFAOYSA-N
Data  2 IC50
  Tab Delimited (TSV)   2D SDfile   Computed 3D by Vconf -m prep SDfile
Find this compound or compounds like it in BindingDB:
Activity Spreadsheet -- Enzyme Inhibition Constant Data from BindingDB
Found 2 hits for monomerid = 241147
TargetAtaxin-2(Homo sapiens (Human))
Novartis
US Patent
LigandPNGBDBM241147(US9409895, 57 | US9630945, 57)
Affinity DataIC50:  17nM. Assay description: ATX activity was determined by measurement of released choline in reactions containing ATX (10 nM), choline oxidase (0.1 U/ml), HRP (100 U/ml), ample...
Ligand InfoPC cidPC sid
In DepthDetails US Patent
TargetEctonucleotide pyrophosphatase/phosphodiesterase family member 2(Homo sapiens (Human))
Novartis
US Patent
LigandPNGBDBM241147(US9409895, 57 | US9630945, 57)
Affinity DataIC50:  17nM. Assay description: ATX activity was determined by measurement of released choline in reactions containing ATX (10 nM), choline oxidase (0.1 U/ml), HRP (100 U/ml), ample...
Ligand InfoPC cidPC sid
In DepthDetails US Patent