BDBM241597 US9409915, 5::US9718820, Compound 5
SMILES Cn1nc(c(Cl)c1-c1nc2nc(cc(Cl)c2n1[Na])-c1ccccc1C(F)(F)F)C(C)(C)C
InChI Key InChIKey=HMGQLJSMNFOJHM-UHFFFAOYSA-N
Data  2 IC50
  Tab Delimited (TSV)   2D SDfile   Computed 3D by Vconf -m prep SDfile
Find this compound or compounds like it in BindingDB:
Activity Spreadsheet -- Enzyme Inhibition Constant Data from BindingDB
Found 2 hits for monomerid = 241597
TargetTransient receptor potential M8 protein(Canis lupus familiaris (Dog))
Janssen Pharmaceutica
US Patent
LigandPNGBDBM241597(US9409915, 5 | US9718820, Compound 5)
Affinity DataIC50:  16nMT: 2°C. Assay description: HEK293 cells stably expressing canine TRPM8 were routinely grown as monolayers in Dulbecco's minimum essential medium supplemented with 10% FBS, ...
Ligand InfoPC cidPC sid
In DepthDetails US Patent
TargetTransient receptor potential M8 protein(Canis lupus familiaris (Dog))
Janssen Pharmaceutica
US Patent
LigandPNGBDBM241597(US9409915, 5 | US9718820, Compound 5)
Affinity DataIC50:  16nMT: 2°C. Assay description: HEK293 cells stably expressing canine TRPM8 were routinely grown as monolayers in Dulbecco's minimum essential medium supplemented with 10% FBS, 2 mM...
Ligand InfoPC cidPC sid
In DepthDetails US Patent