BDBM241601 US9409915, 9
SMILES COc1nc(cc2nc(-c3c(Cl)c(nn3C)C(C)(C)C)n([Na])c12)-c1ccccc1C(F)(F)F
InChI Key InChIKey=DBHIOLAWQHKOOK-UHFFFAOYSA-N
Data  1 IC50
  Tab Delimited (TSV)   2D SDfile   Computed 3D by Vconf -m prep SDfile
Find this compound or compounds like it in BindingDB:
Activity Spreadsheet -- Enzyme Inhibition Constant Data from BindingDB
Found 1 hit for monomerid = 241601
TargetTransient receptor potential M8 protein(Canis lupus familiaris (Dog))
Janssen Pharmaceutica
US Patent
LigandPNGBDBM241601(US9409915, 9)
Affinity DataIC50:  5.60nMT: 2°C. Assay description: HEK293 cells stably expressing canine TRPM8 were routinely grown as monolayers in Dulbecco's minimum essential medium supplemented with 10% FBS, 2 mM...
Ligand InfoPC cidPC sid
In DepthDetails US Patent