BDBM241677 US9409915, 78::US9718820, Compound 78
SMILES COc1nc(cc2nc([nH]c12)-c1c(F)c(nn1C)C(C)(C)C)-c1ccccc1C(F)(F)F
InChI Key InChIKey=MQUKEFPDWZXOPF-UHFFFAOYSA-N
Data  2 IC50
  Tab Delimited (TSV)   2D SDfile   Computed 3D by Vconf -m prep SDfile
Find this compound or compounds like it in BindingDB:
Activity Spreadsheet -- Enzyme Inhibition Constant Data from BindingDB
Found 2 hits for monomerid = 241677
TargetTransient receptor potential M8 protein(Canis lupus familiaris (Dog))
Janssen Pharmaceutica
US Patent
LigandPNGBDBM241677(US9409915, 78 | US9718820, Compound 78)
Affinity DataIC50:  16nMT: 2°C. Assay description: HEK293 cells stably expressing canine TRPM8 were routinely grown as monolayers in Dulbecco's minimum essential medium supplemented with 10% FBS, ...
Ligand InfoPC cidPC sid
In DepthDetails US Patent
TargetTransient receptor potential M8 protein(Canis lupus familiaris (Dog))
Janssen Pharmaceutica
US Patent
LigandPNGBDBM241677(US9409915, 78 | US9718820, Compound 78)
Affinity DataIC50:  16nMT: 2°C. Assay description: HEK293 cells stably expressing canine TRPM8 were routinely grown as monolayers in Dulbecco's minimum essential medium supplemented with 10% FBS, 2 mM...
Ligand InfoPC cidPC sid
In DepthDetails US Patent