BDBM241700 (2S)-N-[5-(1-adamantylmethyl)-1-[(2- methoxynaphthalen-1-yl)methyl]-2,4- dioxo-1,5-benzodiazepin-3-yl]-2- (methylamino)propanamide::US10053431, 110
SMILES CN[C@@H](C)C(=O)NC1C(=O)N(Cc2c(OC)ccc3ccccc23)c2ccccc2N(CC23CC4CC(CC(C4)C2)C3)C1=O
InChI Key InChIKey=ROIZRCWZUQNFED-WQJYIYLMSA-N
Data  2 IC50
  Tab Delimited (TSV)   2D SDfile   Computed 3D by Vconf -m prep SDfile
Find this compound or compounds like it in BindingDB:
Activity Spreadsheet -- Enzyme Inhibition Constant Data from BindingDB
Found 2 hits for monomerid = 241700
TargetE3 ubiquitin-protein ligase XIAP [241-356](Homo sapiens (Human))
Hoffmann-La Roche
US Patent
LigandPNGBDBM241700((2S)-N-[5-(1-adamantylmethyl)-1-[(2- methoxynaphth...)
Affinity DataIC50: >5.48E+4nMpH: 7.5 T: 2°C. Assay description: Ten nanomolar of 6× Histidine-tagged BIR2 domain, corresponding to amino acids 124-240 of XIAP, or BIR3 domain, corresponding to amino acids 241-356 ...
Ligand InfoPC cidPC sid
In DepthDetails US Patent
TargetE3 ubiquitin-protein ligase XIAP [124-240](Homo sapiens (Human))
Hoffmann-La Roche
US Patent
LigandPNGBDBM241700((2S)-N-[5-(1-adamantylmethyl)-1-[(2- methoxynaphth...)
Affinity DataIC50:  278nMpH: 7.5 T: 2°C. Assay description: Ten nanomolar of 6× Histidine-tagged BIR2 domain, corresponding to amino acids 124-240 of XIAP, or BIR3 domain, corresponding to amino acids 241-356 ...
Ligand InfoPC cidPC sid
In DepthDetails US Patent