BDBM241701 ((S)-3-((S)-2-Methylamino-propionylamino)-5-(2-methyl-naphthalen-1-ylmethyl)-4-oxo-2,3,4,5-tetrahydro-benzo[b][1,4]diazepine-1-carboxylic acid methyl ester hydrochloride::US10053431, 20
SMILES CN[C@@H](C)C(=O)N[C@H]1CN(C(=O)OC)c2ccccc2N(Cc2c(C)ccc3ccccc23)C1=O
InChI Key InChIKey=DRJYXRCWKFVLTM-AVRDEDQJSA-N
Data  2 IC50
  Tab Delimited (TSV)   2D SDfile   Computed 3D by Vconf -m prep SDfile
Find this compound or compounds like it in BindingDB:
Activity Spreadsheet -- Enzyme Inhibition Constant Data from BindingDB
Found 2 hits for monomerid = 241701
TargetE3 ubiquitin-protein ligase XIAP [241-356](Homo sapiens (Human))
Hoffmann-La Roche
US Patent
LigandPNGBDBM241701(((S)-3-((S)-2-Methylamino-propionylamino)-5-(2-met...)
Affinity DataIC50: >5.48E+4nMpH: 7.5 T: 2°C. Assay description: Ten nanomolar of 6× Histidine-tagged BIR2 domain, corresponding to amino acids 124-240 of XIAP, or BIR3 domain, corresponding to amino acids 241-356 ...
Ligand InfoPC cidPC sid
In DepthDetails US Patent
TargetE3 ubiquitin-protein ligase XIAP [124-240](Homo sapiens (Human))
Hoffmann-La Roche
US Patent
LigandPNGBDBM241701(((S)-3-((S)-2-Methylamino-propionylamino)-5-(2-met...)
Affinity DataIC50:  588nMpH: 7.5 T: 2°C. Assay description: Ten nanomolar of 6× Histidine-tagged BIR2 domain, corresponding to amino acids 124-240 of XIAP, or BIR3 domain, corresponding to amino acids 241-356 ...
Ligand InfoPC cidPC sid
In DepthDetails US Patent