BDBM24175 3-N,3-N-diethyl-6,6-dimethyl-2-N-(thiophene-2-)-4,5,6,7-tetrahydro-1-benzothiophene-2,3-diamido::thiophene containing compound, 38
SMILES CCN(CC)C(=O)c1c(NC(=O)c2cccs2)sc2CC(C)(C)CCc12
InChI Key InChIKey=NXXLHMNZCKZCSJ-UHFFFAOYSA-N
Data  1 IC50
  Tab Delimited (TSV)   2D SDfile   Computed 3D by Vconf -m prep SDfile
Find this compound or compounds like it in BindingDB:
Activity Spreadsheet -- Enzyme Inhibition Constant Data from BindingDB
Found 1 hit for monomerid = 24175
TargetKinesin-like protein KIF11(Homo sapiens (Human))
Kalypsys
LigandPNGBDBM24175(3-N,3-N-diethyl-6,6-dimethyl-2-N-(thiophene-2-)-4,...)
Affinity DataIC50:  1.20E+4nMpH: 7.0 T: 2°C. Assay description: KSP ATPase activity was determined by measuring production of ADP (ADPQuest Assay, DiscoverX). Raw fluorescence data were normalized to negative (DMS...
In DepthDetails ArticlePubMed