BDBM241757 US9409917, 54
SMILES O=C(NCC1(CCCCC1)c1ccccc1)C1CCOc2ncccc12
InChI Key InChIKey=LGKRSTOHNCFTGP-UHFFFAOYSA-N
Data  1 IC50
  Tab Delimited (TSV)   2D SDfile   Computed 3D by Vconf -m prep SDfile
Find this compound or compounds like it in BindingDB:
Activity Spreadsheet -- Enzyme Inhibition Constant Data from BindingDB
Found 1 hit for monomerid = 241757
TargetP2X purinoceptor 7(Homo sapiens (Human))
Actelion Pharmaceuticals
US Patent
LigandPNGBDBM241757(US9409917, 54)
Affinity DataIC50:  25.8nMT: 2°C. Assay description: HEK cells stably expressing P2X7 were used to screen drugs using the YO-PRO1 assay. Cells were grown to confluency in adherent culture at 37° C. ...
Ligand InfoPC cidPC sid
In DepthDetails US Patent