BDBM24176 3-N,3-N,5-triethyl-2-N-(thiophene-2-)-4,5,6,7-tetrahydro-1-benzothiophene-2,3-diamido::thiophene containing compound, 39
SMILES CCC1CCc2sc(NC(=O)c3cccs3)c(C(=O)N(CC)CC)c2C1
InChI Key InChIKey=XBXVCMFJPOHYPU-UHFFFAOYSA-N
Data  1 IC50
  Tab Delimited (TSV)   2D SDfile   Computed 3D by Vconf -m prep SDfile
Find this compound or compounds like it in BindingDB:
Activity Spreadsheet -- Enzyme Inhibition Constant Data from BindingDB
Found 1 hit for monomerid = 24176
TargetKinesin-like protein KIF11(Homo sapiens (Human))
Kalypsys
LigandPNGBDBM24176(3-N,3-N,5-triethyl-2-N-(thiophene-2-)-4,5,6,7-tetr...)
Affinity DataIC50:  7.40E+3nMpH: 7.0 T: 2°C. Assay description: KSP ATPase activity was determined by measuring production of ADP (ADPQuest Assay, DiscoverX). Raw fluorescence data were normalized to negative (DMS...
In DepthDetails ArticlePubMed