BDBM241848 US9416139, 26
SMILES COC(=O)N[C@@H](C(C)C)C(=O)N1CCC[C@H]1c1ncc([nH]1)-c1ccc(-c2ccc(c3CC4(CCCC4)Cc23)-c2ccc3nc([nH]c(=O)c3c2)[C@@H]2CC3CC3N2C(=O)[C@@H](NC(=O)OC)C(C)C)c2ccccc12
InChI Key InChIKey=GPFCJBLFXROKOH-GIYJNAIESA-N
Data  2 EC50
  Tab Delimited (TSV)   2D SDfile   Computed 3D by Vconf -m prep SDfile
Find this compound or compounds like it in BindingDB:
Activity Spreadsheet -- Enzyme Inhibition Constant Data from BindingDB
Found 2 hits for monomerid = 241848
TargetGenome polyprotein [1973-2419](Hepatitis C virus genotype 1b (isolate Con1) (HCV))
Sunshine Lake Pharma
US Patent
LigandPNGBDBM241848(US9416139, 26)
Affinity DataEC50:  0.216nM. Assay description: The Huh-7 cells transfected with HCV replicons system were seeded into 96-well plates (8,000 cells in 125 μL/well) respectively; each test compoun...
Ligand InfoPC cidPC sid
In DepthDetails US Patent
TargetGenome polyprotein [1973-2420](Hepatitis C virus genotype 1a (HCV))
Sunshine Lake Pharma
US Patent
LigandPNGBDBM241848(US9416139, 26)
Affinity DataEC50:  0.727nM. Assay description: The Huh-7 cells transfected with HCV replicons system were seeded into 96-well plates (8,000 cells in 125 μL/well) respectively; each test compoun...
Ligand InfoPC cidPC sid
In DepthDetails US Patent