BDBM241864 US9416154, 4
SMILES CCCCOC(=O)[C@H](C)NP(=O)(O[C@H](C)[C@H]1O[C@@H](n2cc(F)c3c(N)ncnc23)[C@](C)(O)[C@@H]1O)Oc1cccc2ccccc12
InChI Key InChIKey=PNEVLOKJWBEAIF-PAQLGYABSA-N
Data  1 EC50
  Tab Delimited (TSV)   2D SDfile   Computed 3D by Vconf -m prep SDfile
Find this compound or compounds like it in BindingDB:
Activity Spreadsheet -- Enzyme Inhibition Constant Data from BindingDB
Found 1 hit for monomerid = 241864
TargetGenome polyprotein [2420-3010](Hepatitis C virus genotype 1b (isolate BK) (HCV))
Merck Sharp & Dohme
US Patent
LigandPNGBDBM241864(US9416154, 4)
Affinity DataEC50: >1.00E+5nMpH: 7.3 T: 2°C. Assay description: The ability of the nucleoside triphosphate derivatives to inhibit the enzymatic activity of the HCV NS5B RNA-dependent RNA polymerase was measured in...
Ligand InfoPC cidPC sid
In DepthDetails US Patent