BDBM241881 US9416154, 32
SMILES CC(C)OC(=O)[C@H](C)NP(=O)(Oc1cccc2ccccc12)OC(C)(C)[C@H]1O[C@@H](n2ccc3c(N)ncnc23)[C@](C)(F)[C@@H]1O
InChI Key InChIKey=BKXPIBZOEWZFFL-NQYIIHRFSA-N
Data  1 EC50
  Tab Delimited (TSV)   2D SDfile   Computed 3D by Vconf -m prep SDfile
Find this compound or compounds like it in BindingDB:
Activity Spreadsheet -- Enzyme Inhibition Constant Data from BindingDB
Found 1 hit for monomerid = 241881
TargetGenome polyprotein [2420-3010](Hepatitis C virus genotype 1b (isolate BK) (HCV))
Merck Sharp & Dohme
US Patent
LigandPNGBDBM241881(US9416154, 32)
Affinity DataEC50: >2.00E+4nMpH: 7.3 T: 2°C. Assay description: The ability of the nucleoside triphosphate derivatives to inhibit the enzymatic activity of the HCV NS5B RNA-dependent RNA polymerase was measured in...
Ligand InfoPC cidPC sid
In DepthDetails US Patent