BDBM241922 US9421177, VPC143105
SMILES N\C(=N/O)C1(CC1)C(=O)Nc1ccc(CCCCCCCOCC2CCCCC2)cc1
InChI Key InChIKey=IQKBKECLEUPJIH-UHFFFAOYSA-N
Data  2 KI
  Tab Delimited (TSV)   2D SDfile   Computed 3D by Vconf -m prep SDfile
Find this compound or compounds like it in BindingDB:
Activity Spreadsheet -- Enzyme Inhibition Constant Data from BindingDB
Found 2 hits for monomerid = 241922
TargetSphingosine kinase 1(Homo sapiens (Human))
University Of Virginia Patent Foundation
US Patent
LigandPNGBDBM241922(US9421177, VPC143105)
Affinity DataKi:  240nM ΔG°:  -9.39kcal/moleT: 2°C. Assay description: Sphingosine kinase activity was assessed as described previously (Kharel, Y., Lee, S., Snyder, A. H., Sheasley-O'Neill, S. L., Morris, M. A., Set...
Ligand InfoPC cidPC sid
In DepthDetails US Patent
TargetSphingosine kinase 2(Mus musculus (Mouse))
University Of Virginia Patent Foundation
US Patent
LigandPNGBDBM241922(US9421177, VPC143105)
Affinity DataKi:  7.00E+3nM ΔG°:  -7.31kcal/moleT: 2°C. Assay description: Sphingosine kinase activity was assessed as described previously (Kharel, Y., Lee, S., Snyder, A. H., Sheasley-O'Neill, S. L., Morris, M. A., Set...
Ligand InfoPC cidPC sid
In DepthDetails US Patent