BDBM241947 US9428466, 4'-hydroxymerbarone
SMILES Oc1ccc(NC(=O)c2c(O)[nH]c(=S)[nH]c2=O)cc1
InChI Key InChIKey=DVMISDHNZIDREG-UHFFFAOYSA-N
Data  2 IC50
  Tab Delimited (TSV)   2D SDfile   Computed 3D by Vconf -m prep SDfile
Find this compound or compounds like it in BindingDB:
Activity Spreadsheet -- Enzyme Inhibition Constant Data from BindingDB
Found 2 hits for monomerid = 241947
TargetXanthine dehydrogenase/oxidase(Homo sapiens (Human))
TBA
US Patent
LigandPNGBDBM241947(US9428466, 4'-hydroxymerbarone)
Affinity DataIC50:  680nM. Assay description: Xanthine oxidase inhibition was determined using a standard fluorescence-based assay for xanthine oxidase activity (McHale A, Grimes H, Coughlan M P:...
Ligand InfoPC cidPC sid
In DepthDetails US Patent
TargetSolute carrier family 22 member 12(Homo sapiens (Human))
TBA
US Patent
LigandPNGBDBM241947(US9428466, 4'-hydroxymerbarone)
Affinity DataIC50:  9.40E+3nM. Assay description: URAT1 (SLC22A12) activity was evaluated in a cellular uptake assay using a 96-well plate with stably transfected URAT-1/CHO cells. 3H-orotate was use...
Ligand InfoPC cidPC sid
In DepthDetails US Patent