BDBM242356 US10047093, 8-13::US10392392, Example 8-13::US10875864, EX. 8-13::US9416132, 8-13
SMILES FC(F)(F)Oc1cccc(c1)-c1cnc2ccc(NCC3CCS(=O)(=O)CC3)nn12
InChI Key InChIKey=JABDFUFLQGAQCU-UHFFFAOYSA-N
Data  8 IC50
  Tab Delimited (TSV)   2D SDfile   Computed 3D by Vconf -m prep SDfile
Find this compound or compounds like it in BindingDB:
Activity Spreadsheet -- Enzyme Inhibition Constant Data from BindingDB
Found 8 hits for monomerid = 242356
TargetSerine/threonine-protein kinase pim-1(Homo sapiens (Human))
Tolero Pharmaceuticals
US Patent
LigandPNGBDBM242356(US10047093, 8-13 | US10392392, Example 8-13 | US10...)
Affinity DataIC50:  58nMT: 2°C. Assay description: These assays are set up in duplicate 50 ul volumes in white, flat bottom 96 well plates. Inhibitors are added to the solution of 1× kinase buff...
Ligand InfoPC cidPC sid
In DepthDetails US Patent
TargetPotassium voltage-gated channel subfamily H member 2(Homo sapiens (Human))
Tolero Pharmaceuticals
US Patent
LigandPNGBDBM242356(US10047093, 8-13 | US10392392, Example 8-13 | US10...)
Affinity DataIC50:  1.00E+4nM. Assay description: Representative compounds were tested for hERG activity using the Fast Patch assay available from WuXiApptec (Shanghai China).
Ligand InfoPC cidPC sid
In DepthDetails US Patent
TargetSerine/threonine-protein kinase pim-1(Homo sapiens (Human))
Tolero Pharmaceuticals
US Patent
LigandPNGBDBM242356(US10047093, 8-13 | US10392392, Example 8-13 | US10...)
Affinity DataIC50:  58nMT: 2°C. Assay description: One illustrative manner in which Pim-1 kinase activity can be determined is by quantifying the amount of ATP remaining in solution after an in vitro ...
Ligand InfoPC cidPC sid
In DepthDetails US Patent
TargetPotassium voltage-gated channel subfamily H member 2(Homo sapiens (Human))
Tolero Pharmaceuticals
US Patent
LigandPNGBDBM242356(US10047093, 8-13 | US10392392, Example 8-13 | US10...)
Affinity DataIC50:  1.00E+4nM. Assay description: Representative compounds were tested for hERG activity using the Fast Patch assay available from WuXiApptec (Shanghai China).
Ligand InfoPC cidPC sid
In DepthDetails US Patent
TargetSerine/threonine-protein kinase pim-1(Homo sapiens (Human))
Tolero Pharmaceuticals
US Patent
LigandPNGBDBM242356(US10047093, 8-13 | US10392392, Example 8-13 | US10...)
Affinity DataIC50:  58nM. Assay description: One illustrative manner in which Pim-1 kinase activity can be determined is by quantifying the amount of ATP remaining in solution after an in vitro ...
Ligand InfoPC cidPC sid
In DepthDetails US Patent
TargetPotassium voltage-gated channel subfamily H member 2(Homo sapiens (Human))
Tolero Pharmaceuticals
US Patent
LigandPNGBDBM242356(US10047093, 8-13 | US10392392, Example 8-13 | US10...)
Affinity DataIC50:  1.00E+4nM. Assay description: hERG activity assays representative compounds were tested for hERG activity using the Fast Patch assay available from WuXiApptec (Shanghai China).
Ligand InfoPC cidPC sid
In DepthDetails US Patent
TargetSerine/threonine-protein kinase pim-1(Homo sapiens (Human))
Tolero Pharmaceuticals
US Patent
LigandPNGBDBM242356(US10047093, 8-13 | US10392392, Example 8-13 | US10...)
Affinity DataIC50:  58nM. Assay description: One illustrative manner in which Pim-1 kinase activity can be determined is by quantifying the amount of ATP remaining in solution after an in vitro ...
Ligand InfoPC cidPC sid
In DepthDetails US Patent
TargetPotassium voltage-gated channel subfamily H member 2(Homo sapiens (Human))
Tolero Pharmaceuticals
US Patent
LigandPNGBDBM242356(US10047093, 8-13 | US10392392, Example 8-13 | US10...)
Affinity DataIC50:  1.00E+4nM. Assay description: Representative compounds were tested for hERG activity using the Fast Patch assay available from WuXiApptec (Shanghai China).
Ligand InfoPC cidPC sid
In DepthDetails US Patent