BDBM242375 US9416132, 8-32
SMILES CO[C@H]1CC[C@@H](CC1)Nc1ccc2ncc(-c3cccc(c3)C(F)(F)F)n2n1
InChI Key InChIKey=HLNDIWMNQHSGRA-WKILWMFISA-N
Data  1 IC50
  Tab Delimited (TSV)   2D SDfile   Computed 3D by Vconf -m prep SDfile
Find this compound or compounds like it in BindingDB:
Activity Spreadsheet -- Enzyme Inhibition Constant Data from BindingDB
Found 1 hit for monomerid = 242375
TargetSerine/threonine-protein kinase pim-1(Homo sapiens (Human))
Tolero Pharmaceuticals
US Patent
LigandPNGBDBM242375(US9416132, 8-32)
Affinity DataIC50:  115nMT: 2°C. Assay description: These assays are set up in duplicate 50 ul volumes in white, flat bottom 96 well plates. Inhibitors are added to the solution of 1× kinase buff...
Ligand InfoPC cidPC sid
In DepthDetails US Patent