BDBM242397 US10047093, 8-79::US10392392, Example 8-79::US10875864, EX. 8-79::US9416132, 8-79
SMILES CC(C)(N)[C@H]1CC[C@@H](CC1)Nc1ccc2ncc(-c3cccc(Cl)c3)n2n1
InChI Key InChIKey=RYHKIZUUEVTDMH-JCNLHEQBSA-N
Data  4 IC50
  Tab Delimited (TSV)   2D SDfile   Computed 3D by Vconf -m prep SDfile
Find this compound or compounds like it in BindingDB:
Activity Spreadsheet -- Enzyme Inhibition Constant Data from BindingDB
Found 4 hits for monomerid = 242397
TargetSerine/threonine-protein kinase pim-1(Homo sapiens (Human))
Tolero Pharmaceuticals
US Patent
LigandPNGBDBM242397(US10047093, 8-79 | US10392392, Example 8-79 | US10...)
Affinity DataIC50:  2nMT: 2°C. Assay description: These assays are set up in duplicate 50 ul volumes in white, flat bottom 96 well plates. Inhibitors are added to the solution of 1× kinase buff...
Ligand InfoPC cidPC sid
In DepthDetails US Patent
TargetSerine/threonine-protein kinase pim-1(Homo sapiens (Human))
Tolero Pharmaceuticals
US Patent
LigandPNGBDBM242397(US10047093, 8-79 | US10392392, Example 8-79 | US10...)
Affinity DataIC50:  2nM. Assay description: One illustrative manner in which Pim-1 kinase activity can be determined is by quantifying the amount of ATP remaining in solution after an in vitro ...
Ligand InfoPC cidPC sid
In DepthDetails US Patent
TargetSerine/threonine-protein kinase pim-1(Homo sapiens (Human))
Tolero Pharmaceuticals
US Patent
LigandPNGBDBM242397(US10047093, 8-79 | US10392392, Example 8-79 | US10...)
Affinity DataIC50:  2nM. Assay description: One illustrative manner in which Pim-1 kinase activity can be determined is by quantifying the amount of ATP remaining in solution after an in vitro ...
Ligand InfoPC cidPC sid
In DepthDetails US Patent
TargetSerine/threonine-protein kinase pim-1(Homo sapiens (Human))
Tolero Pharmaceuticals
US Patent
LigandPNGBDBM242397(US10047093, 8-79 | US10392392, Example 8-79 | US10...)
Affinity DataIC50:  2nMT: 2°C. Assay description: One illustrative manner in which Pim-1 kinase activity can be determined is by quantifying the amount of ATP remaining in solution after an in vitro ...
Ligand InfoPC cidPC sid
In DepthDetails US Patent