BDBM242459 US9422235, 35
SMILES FC(F)(F)c1cc(Nc2ccc(Cl)cc2Cl)ccc1S(=O)(=O)NCC1CCOCC1
InChI Key InChIKey=AVNHLPCVJAOWMG-UHFFFAOYSA-N
Data  2 KI  2 IC50
  Tab Delimited (TSV)   2D SDfile   Computed 3D by Vconf -m prep SDfile
Find this compound or compounds like it in BindingDB:
Activity Spreadsheet -- Enzyme Inhibition Constant Data from BindingDB
Found 2 hits for monomerid = 242459
TargetCannabinoid receptor 2(Homo sapiens (Human))
Pharmos
US Patent
LigandPNGBDBM242459(US9422235, 35)
Affinity DataKi:  87nM ΔG°:  -9.79kcal/mole IC50:  206nMT: 2°C. Assay description: The binding assays were performed by testing the ability of the new compounds to displace the radiolabeled synthetic non-selective cannabinoid agonis...
Ligand InfoPC cidPC sid
In DepthDetails US Patent
TargetCannabinoid receptor 1(Homo sapiens (Human))
Pharmos
US Patent
LigandPNGBDBM242459(US9422235, 35)
Affinity DataKi:  5.84E+3nM ΔG°:  -7.25kcal/mole IC50:  1.38E+4nMT: 2°C. Assay description: The binding assays were performed by testing the ability of the new compounds to displace the radiolabeled synthetic non-selective cannabinoid agonis...
Ligand InfoPC cidPC sid
In DepthDetails US Patent